{"text_format":"1","workbook":"xlsx","n_sheets":12,"sheets":["Worksheet","Day Care Credit","Tax Rate","Age of Children","Tax Cons.","EPT Final","Schedules","Interstate Pay","Extended","EPT Draft","Sheet11","Tax Rates"],"not_rendered":{"charts":0,"images":0,"macros":1,"external_links":0,"defined_names":6,"comments":1,"pivot_tables":0},"unopened":[],"bounds":{"document_bytes":16777216,"sheet_cells":100000,"rows_first":2000,"rows_last":500,"rows_between":2000,"halvings":0,"cell_chars":16384,"cell_head_chars":4096},"cells_cut":0,"cells_raw":0,"read":"whole","date_system":"1900"}

{"sheet":"Worksheet","index":0,"n_rows":327,"n_cols":58,"rows_kept":327,"cut":false,"hidden":false,"merged":[[44,6,44,8],[8,1,8,11],[3,1,3,11],[4,1,4,11],[7,1,7,11],[65,1,65,4],[83,6,83,7],[89,6,89,7],[89,1,89,4],[74,1,74,4],[72,1,72,4],[85,6,85,7],[75,1,75,4],[76,1,76,4],[83,1,83,4],[77,1,77,4],[78,1,78,4],[25,1,25,4],[26,1,26,4],[31,1,31,4],[27,1,27,4],[29,1,29,4],[60,1,60,4],[39,1,39,4],[0,1,0,11],[1,1,1,11],[2,1,2,11],[5,1,5,11],[32,5,32,6],[39,5,39,6],[35,1,35,4],[15,1,15,4],[20,1,20,4],[24,1,24,4],[11,1,11,4],[12,1,12,4],[9,4,9,5],[10,4,10,5],[21,1,21,4],[16,1,16,4],[14,1,14,4],[9,1,9,3],[10,1,10,3],[13,1,13,4],[19,1,19,4],[18,1,18,4],[23,1,23,4],[6,1,6,11],[32,1,32,4],[33,1,33,4],[34,1,34,4],[59,1,59,4],[55,1,55,4],[41,1,41,4],[42,1,42,4],[44,1,44,4],[40,1,40,4],[47,1,47,4],[48,1,48,4],[215,3,215,5],[108,2,108,11],[109,2,109,11],[118,2,118,11],[162,7,162,9],[205,7,205,9],[208,7,208,9],[149,4,149,5],[151,4,151,5],[152,4,152,5],[117,2,117,11],[110,6,110,7],[111,3,111,5],[213,3,213,5],[211,7,211,9],[207,3,207,4],[155,8,155,9],[101,6,101,8],[100,6,100,8],[100,2,100,4],[62,1,62,4],[70,1,70,4],[71,1,71,4],[73,1,73,4],[212,3,212,5],[102,2,102,4],[210,3,210,4],[211,3,211,4],[93,1,93,4],[99,2,99,4],[105,1,105,7],[79,1,79,4],[84,1,84,4],[85,1,85,4],[86,1,86,4],[88,1,88,4],[92,1,92,4],[91,1,91,4],[106,1,106,7],[104,1,104,7],[103,1,103,4],[94,1,94,4],[95,1,95,4],[96,1,96,4],[97,1,97,4],[98,1,98,4],[208,3,208,5],[209,3,209,5],[101,2,101,4],[51,1,51,4],[90,1,90,4]]}
["INSTRUCTIONS","1.  Blue Fields:       User must enter data into the location e.g. Name of Petitioner user must type in the name of the Petitioner.",null,null,null,null,null,null,null,null,null,null,null,null,null,null,null,null,null,null,null,null,null,null,null,null,null,null,null,null,null,null,null,null,null,null,null,null,null,null,null,null,"Attorney for Petitioner"]
[null,"2.  Yellow Fields:    User must select from the drop down box only e.g. Main. Requested (Y or N) and answer is No, user ",null,null,null,null,null,null,null,null,null,null,null,null,null,null,null,null,null,null,null,null,null,null,null,null,null,null,null,null,null,null,null,null,null,null,null,null,null,null,null,null,"Attorney for Respondent"]
[null,"                                 must select N from the drop down box and not type in the letter N.    Such typing will be rejected.",null,null,null,null,null,null,null,null,null,null,null,null,null,null,null,null,null,null,null,null,null,null,null,null,null,null,null,null,null,null,null,null,null,null,null,null,null,null,null,null,"Pro Se"]
[null,"                                 To activate the drop down choices place the cursor (mouse) in the box and hit the left button on the mouse, drop                        "]
[null,"                                 down arrow will appear on the right side of the location."]
[null,"3.  Black or White Fields:     User should disregard as the information sought does not apply to user's case.",null,null,null,null,null,null,null,null,null,null,null,null,null,null,null,null,null,null,null,null,null,null,"Allen",null,null,"Johnson  "]
["TIPS","IMPORTANT TO FOLLOW THE DIRECTIONS ENTIRELY FOR THE CALCULATOR TO WORK PROPERLY.",null,null,null,null,null,null,null,null,null,null,null,null,null,null,null,null,null,null,null,null,null,null,null,null,null,"Allen  "]
[null,"PLACE AND HOLD CURSOR IN FIELD AND HINT SHOULD APPEAR EXPLAINING WHAT IS BEING SOUGHT."]
[null,"USER SHOULD BE ABLE TO UTILIZE THE TAB KEY TO MOVE TO THE NEXT FIELD.",null,null,null,null,null,null,null,null,null,null,null,null,null,null,null,null,null,null,null,null,null,null,null,null,null,"Anderson  "]
["CAPTION","Name of Petitioner",null,null,null,null,null,null,null,null,null,null,null,null,"P","Head of Household",null,null,"Yes",null,"Atty for Petitioner",null,null,null,"Anderson",null,null,"Atchison  "]
{"$rows_left_out":318}
{"sheet":"Day Care Credit","index":1,"n_rows":54,"n_cols":14,"rows_kept":54,"cut":false,"hidden":true,"merged":[]}
[]
[]
[]
[null,null,null,null,"Day Care Computation"]
[]
[]
[]
[]
[null,null,null,"Work Related Day Care"]
[null,null,null,null,null,null,null,1,2,{"$f":"Worksheet!J151","v":1}]
{"$rows_left_out":45}
{"sheet":"Tax Rate","index":2,"n_rows":78,"n_cols":22,"rows_kept":78,"cut":false,"hidden":true,"merged":[[18,13,18,14],[41,4,41,5],[41,7,41,8],[40,4,40,9],[42,4,42,5]]}
[]
[null,null,null,null,null,null,null,null,null,{"$f":"IF(Worksheet!F34=\"N\",Worksheet!F45=\"M\")*Worksheet!F21","v":0},null,"Mother Cust Not HH"]
[null,null,null,null,null,null,null,null,null,{"$f":"IF(Worksheet!F34=\"N\",Worksheet!F45=\"F\")*Worksheet!F16","v":0},null,"Father Cust Not HH",null,null,null,null,null,null,null,null,"noncustodial"]
[null,null,null,null,null,null,null,null,null,{"$f":"K4+K5","v":0},{"$f":"IF(Worksheet!F45=\"M\",Worksheet!F34=\"Y\")*Worksheet!F21","v":0},"Mother Head of HH",null,null,null,"Noncustodial",null,"Gross",{"$f":"IF(Worksheet!F45=\"m\",Worksheet!F16,Worksheet!F21)","v":0},null,"federal tax rates"]
[null,null,null,null,null,null,null,null,null,50000,{"$f":"IF(Worksheet!F45=\"F\",Worksheet!F34=\"Y\")*Worksheet!F16","v":0},"Father Head of HH",null,null,null,null,null,null,null,null,"Single","Joint"]
[null,null,null,null,"Federal",null,null,2013,null,null,{"$f":"K4+K5","v":0},null,null,null,null,"Single",null,"Joint"]
[null,null,null,"(HOH)","Standard Deduction",null,null,8950,null,null,null,null,null,"Stand. Deduction",null,6100,null,12200,null,null,{"$f":"IF(S4>E27,S4<E28)*F28","v":0},{"$f":"IF(S4>M27,S4<M28)*N28","v":0}]
[null,null,null,null,"Normal Exemption",null,null,3900,null,null,null,null,null,"Normal Exempt",null,3900,null,3900,null,null,{"$f":"IF(S4>=E28,S4<E29)*F29","v":0},{"$f":"IF(S4>=M28,S4<M29)*N29","v":0}]
[null,null,null,null,"Available Exemption",null,null,3900,null,null,null,null,null,"Total Deduction",null,{"$f":"SUM(P7:P8)","v":10000},null,{"$f":"SUM(R7:R8)","v":16100},null,null,{"$f":"IF(S4>=E29,S4<E30)*F30","v":0},{"$f":"IF(S4>=M29,S4<M30)*N30","v":0}]
[null,null,null,null,"Parent's Exemption",null,null,1,null,null,null,null,null,"Fed Adj Gross",null,{"$f":"S4-P9","v":-10000},null,{"$f":"S4-R9","v":-16100},null,null,{"$f":"IF(S4>=E30,S4<E31)*F31","v":0},{"$f":"IF(S4>=M30,S4<M31)*N31","v":0}]
{"$rows_left_out":69}
{"sheet":"Age of Children","index":3,"n_rows":31,"n_cols":9,"rows_kept":31,"cut":false,"hidden":true,"merged":[]}
[]
[null,null,null,null,null,null,"0-5","6-11","12-18"]
[null,"Child 1",{"$f":"Worksheet!F48","v":"00:00:00"},null,0,null,{"$f":"IF(C6>E3,C6<E4)*1","v":0},{"$f":"IF(C6>=E4,C6<E5)*1","v":0},{"$f":"IF(C6>=E5,1,0)","v":1}]
[null,null,{"$f":"TODAY()","v":"2013-09-11"},null,5.5,null,{"$f":"IF(C11>E3,C11<E4)*1","v":0},{"$f":"IF(C11>=E4,C11<E5)*1","v":0},{"$f":"IF(C11>=E5,1,0)","v":0}]
[null,null,{"$f":"C4-C3","v":41528},null,11.5,null,{"$f":"IF(C16>E3,C16<E4)*1","v":0},{"$f":"IF(C16>=E4,C16<E5)*1","v":0},{"$f":"IF(C16>=E5,1,0)","v":0}]
[null,null,{"$f":"C5/365","v":113.77534246575343},null,null,null,{"$f":"IF(C21>E3,C21<E4)*1","v":0},{"$f":"IF(C21>=E4,C21<E5)*1","v":0},{"$f":"IF(C21>=E5,1,0)","v":0}]
[null,null,null,null,null,null,{"$f":"IF(C26>E3,C26<E4)*1","v":0},{"$f":"IF(C26>=E4,C26<E5)*1","v":0},{"$f":"IF(C26>=E5,1,0)","v":0}]
[null,"Child 2",{"$f":"Worksheet!F52","v":"NA"},null,null,null,{"$f":"IF(C31>E3,C31<E4)*1","v":0},{"$f":"IF(C31>=E4,C31<E5)*1","v":0},{"$f":"IF(C31>=E5,1,0)","v":0}]
[null,null,{"$f":"TODAY()","v":"2013-09-11"},null,null,null,{"$f":"SUM(G3:G8)","v":0},{"$f":"SUM(H3:H8)","v":0},{"$f":"SUM(I3:I8)","v":1}]
[null,null,{"$f":"IF(C8=\"na\",0,C9-C8)","v":0}]
{"$rows_left_out":22}
{"sheet":"Tax Cons.","index":4,"n_rows":52,"n_cols":14,"rows_kept":52,"cut":false,"hidden":false,"merged":[[1,8,2,8],[1,7,2,7]]}
[null,null,null,null,{"$f":"Worksheet!D162","v":"Case No."},{"$f":"Worksheet!E162","v":0}]
[null,null,null,null,null,null,null,"Exempt Value","Non Cust Tax Rate","Product"]
[null,null,null,null,"Tax Ex. Not Alternated"]
[null,null,null,null,"Tax Exemption (Federal)",null,null,3900,{"$f":"H40","v":0},{"$f":"H4*I4","v":0}]
[null,null,null,null,"Tax Exemption (State)",null,null,2250,{"$f":"H44","v":0},{"$f":"H5*I5","v":0}]
[null,null,null,null,"Annual Value",null,null,null,null,{"$f":"SUM(J4:J5)","v":0}]
[null,null,null,null,"Noncustodial % of Earnings",null,null,null,null,{"$f":"H48","v":{"$error":"#DIV/0!"}}]
[null,null,null,null,"Noncustodial's Value",null,null,null,null,{"$f":"J6*J7/100","v":{"$error":"#DIV/0!"}}]
[null,null,null,null,"Monthly Value",null,null,null,null,{"$f":"J8/12","v":{"$error":"#DIV/0!"}}]
[null,null,null,null,"Number of More Children Claimed by Mother",null,null,null,null,{"$f":"Worksheet!N73","v":0},null,null,"Mother",{"$f":"IF(J10>0,M20,-M20)","v":{"$error":"#DIV/0!"}}]
{"$rows_left_out":43}
{"sheet":"EPT Final","index":5,"n_rows":34,"n_cols":14,"rows_kept":34,"cut":false,"hidden":false,"merged":[[1,5,1,8]]}
[null,null,null,{"$f":"Worksheet!D162","v":"Case No."},{"$f":"Worksheet!E162","v":0}]
[null,null,null,null,null,"Equal Parenting Time Worksheet"]
[]
[null,null,null,"Step 1",1,"Higher Amount from Line F.3",null,null,null,null,{"$f":"IF(Worksheet!H198>Worksheet!J198,Worksheet!H198,Worksheet!J198)","v":{"$error":"#N/A"}}]
[null,null,null,null,2,"Lower Amount from Line F.3",null,null,null,null,{"$f":"IF(Worksheet!J198<Worksheet!H198,Worksheet!J198,Worksheet!H198)","v":{"$error":"#N/A"}}]
[null,null,null,null,3,"Subtract 2 from 1",null,null,null,null,{"$f":"K4-K5","v":{"$error":"#N/A"}}]
[null,null,null,null,4,"Line 3 x .5",null,null,null,null,{"$f":"K6*0.5","v":{"$error":"#N/A"}}]
[null,null,null,"Step 2",5,"Enter the total Line D.1",null,null,null,null,{"$f":"Worksheet!L141","v":0}]
[null,null,null,null,6,"Enter the total Line D.3",null,null,null,null,{"$f":"Worksheet!L156","v":{"$error":"#N/A"}}]
[null,null,null,null,7,"If written agreement provide clothing (Y or N)",null,null,null,null,{"$f":"Worksheet!F90","v":"N"}]
{"$rows_left_out":25}
{"sheet":"Schedules","index":6,"n_rows":177,"n_cols":40,"rows_kept":177,"cut":false,"hidden":true,"merged":[]}
[null,null,"One",null,null,"Two",null,null,"Three",null,null,"Four",null,null,"Five",null,null,"Six"]
["Income","0-5","6-11","12-19","0-5","6-11","12-19","0-5","6-11","12-19","0-5","6-11","12-19","0-5","6-11","12-19","0-5","6-11","12-19",null,null,"Income","0-5","6-11","12-18","Income","0-5","6-11","12-18"]
[50,8,10,11,6,7,8,5,6,7,4,5,6,4,4,5,3,4,4,null,null," 1650  "," 275  "," 317  "," 344  "," 4500  "," 628  "," 723  "," 786  "]
[100,17,19,21,12,14,16,11,12,13,9,10,11,8,9,10,7,8,9,null,null," 1700  "," 282  "," 324  "," 353  "," 4600  "," 640  "," 736  "," 800  ",null,null,{"$f":"IF(Worksheet!L141<2000,ROUND(Worksheet!L141/50,0)*50,ROUND(Worksheet!L141/100,0)*100)","v":0},"Rounded Income"]
[150,25,29,32,19,21,23,16,19,20,13,15,17,12,13,15,10,12,13,null,null," 1750  "," 289  "," 332  "," 361  "," 4700  "," 651  "," 749  "," 814  ",null,{"$f":"Worksheet!L141","v":0}]
[200,34,39,42,25,29,31,22,25,27,18,20,22,16,18,20,14,16,17,null,null," 1800  "," 296  "," 340  "," 370  "," 4800  "," 663  "," 762  "," 828  ",null,{"$f":"IF(AF4<=15500,AF4,100)","v":0},"Income"]
[250,42,49,53,31,36,39,27,31,34,22,26,28,20,22,24,17,20,22,null,null," 1850  "," 302  "," 348  "," 378  "," 4900  "," 674  "," 775  "," 843  "]
[300,51,58,63,37,43,47,32,37,40,27,31,33,23,27,29,21,24,26,null,null," 1900  "," 309  "," 356  "," 386  "," 5000  "," 685  "," 788  "," 857  ",null,"Amt:",null,"Age:","Group",{"$f":"Worksheet!I84","v":0},"Number of Children if Multi Family"]
[350,59,68,74,43,50,54,38,43,47,31,36,39,27,31,34,24,28,30,null,null," 1950  "," 316  "," 363  "," 395  "," 5100  "," 697  "," 801  "," 871  ",{"$f":"IF(ISBLANK(AG9),\"\",VLOOKUP(AE$6,A$3:S$177,ROUNDUP(AG9/5,0)+1+(AG$15-1)*3))","v":{"$error":"#N/A"}},{"$f":"AD9","v":{"$error":"#N/A"}},"Child 1",{"$f":"'Age of Children'!C6","v":113.77534246575343},{"$f":"IF(AND(AG9>=18,Worksheet!I48=\"Y\"),99,IF(AG9>=11.5,3,IF(AG9>=5.5,2,IF(AG9>0,1,99))))","v":3},{"$f":"IF(AG9>1,1)","v":1}]
[400,67,78,84,50,57,62,43,50,54,36,41,44,31,36,39,28,32,35,null,null," 2000  "," 322  "," 371  "," 403  "," 5200  "," 708  "," 814  "," 885  ",{"$f":"IF(ISBLANK(AG10),\"\",VLOOKUP(AE$6,A$3:S$177,ROUNDUP(AG10/5,0)+1+(AG$15-1)*3))","v":{"$error":"#N/A"}},{"$error":"#N/A"},"Child 2",{"$f":"'Age of Children'!C11","v":0},{"$f":"IF(AND(AG10>=18,Worksheet!I52=\"Y\"),99,IF(AG10>=11.5,3,IF(AG10>=5.5,2,IF(AG10>0,1,99))))","v":99},false]
{"$rows_left_out":168}
{"sheet":"Interstate Pay","index":7,"n_rows":56,"n_cols":14,"rows_kept":56,"cut":false,"hidden":true,"merged":[]}
[]
[null,null,null,null,null,"State","Weekly Wage ","Kansas Weekly Wage","h/g","agi","State","Adjusted AGI"]
[]
[null,null,null,null,null,"Alaska",null,null,{"$f":"H4/G4","v":{"$error":"#DIV/0!"}},{"$f":"IF(Worksheet!F45=\"m\",Worksheet!J124,Worksheet!H124)","v":0},null,0,{"$f":"J4-L4","v":0},{"$f":"-M4","v":0}]
[null,null,null,null,null,"Alabama",784,null,{"$f":"G21/G5","v":0.97066326530612246},{"$f":"IF(Worksheet!I86=\"F\",Worksheet!J124,Worksheet!H124)","v":0},{"$f":"IF(Worksheet!F89='Interstate Pay'!F5,L5,0)","v":0},{"$f":"I5*J5","v":0},{"$f":"J5-L5","v":0},{"$f":"-M5","v":0}]
[null,null,null,null,null,"Alaska",961,null,{"$f":"G21/G6","v":0.79188345473465138},{"$f":"IF(Worksheet!I86=\"F\",Worksheet!J124,Worksheet!H124)","v":0},{"$f":"IF(Worksheet!F89='Interstate Pay'!F6,L6,0)","v":0},{"$f":"I6*J7","v":0},{"$f":"J7-L6","v":0},0]
[null,null,null,null,null,"Arizona",846,null,{"$f":"G21/G7","v":0.89952718676122934},{"$f":"IF(Worksheet!I86=\"F\",Worksheet!J124,Worksheet!H124)","v":0},{"$f":"IF(Worksheet!F89='Interstate Pay'!F7,L7,0)","v":0},0,0,0]
[null,null,null,null,null,"Arkansas",708,null,{"$f":"G21/G8","v":1.0748587570621468},{"$f":"IF(Worksheet!I86=\"F\",Worksheet!J124,Worksheet!H124)","v":0},{"$f":"IF(Worksheet!F89='Interstate Pay'!F8,L8,0)","v":0},0,0,0]
[null,null,null,null,null,"California ",1036,null,{"$f":"G21/G9","v":0.73455598455598459},{"$f":"IF(Worksheet!I86=\"F\",Worksheet!J124,Worksheet!H124)","v":0},{"$f":"IF(Worksheet!F89='Interstate Pay'!F9,L9,0)","v":0},0,0,0]
[null,null,null,null,null,"Colorado ",936,null,{"$f":"G21/G10","v":0.81303418803418803},{"$f":"IF(Worksheet!I86=\"F\",Worksheet!J124,Worksheet!H124)","v":0},{"$f":"IF(Worksheet!F89='Interstate Pay'!F10,L10,0)","v":0},0,0,0]
{"$rows_left_out":47}
{"sheet":"Extended","index":8,"n_rows":27,"n_cols":9,"rows_kept":27,"cut":false,"hidden":true,"merged":[]}
[]
[null,null,1,2,3,4,5,6]
[null,"Income",{"$f":"Worksheet!L141","v":0},{"$f":"C3","v":0},{"$f":"C3","v":0},{"$f":"C3","v":0},{"$f":"C3","v":0},{"$f":"C3","v":0}]
[null,"Power",{"$f":"POWER(C3,0.689838232)","v":0},{"$f":"POWER(C3,0.689838232)","v":0},{"$f":"POWER(C3,0.689838232)","v":0},{"$f":"POWER(C3,0.689838232)","v":0},{"$f":"POWER(C3,0.689838232)","v":0},{"$f":"POWER(C3,0.689838232)","v":0}]
[null,"Multiplier",2.7951823930000002,2.0497424120000001,1.822812799,1.5619646949999999,1.3914601520000001,1.265842221]
[null,"Product",{"$f":"C4*C5","v":0},{"$f":"D4*D5","v":0},0,0,0,0]
[null,"12-18",{"$f":"C6","v":0},{"$f":"D6","v":0},0,0,0,0]
[null,null,0.92,0.92,0.92,0.92,0.92,0.92]
[null,"6-11",{"$f":"C7*C8","v":0},{"$f":"D7*D8","v":0},0,0,0,0]
[null,null,0.8,0.8,0.8,0.8,0.8,0.8]
{"$rows_left_out":18}
{"sheet":"EPT Draft","index":9,"n_rows":34,"n_cols":18,"rows_kept":34,"cut":false,"hidden":true,"merged":[[1,5,1,8]]}
[]
[null,null,null,null,null,"Equal Parenting Time Worksheet"]
[]
[null,null,null,"Step 1",1,"Higher Amount from Line F.3",null,null,null,null,{"$f":"IF(Worksheet!H198>Worksheet!J198,Worksheet!H198,Worksheet!J198)","v":{"$error":"#N/A"}}]
[null,null,null,null,2,"Lower Amount from Line F.3",null,null,null,null,{"$f":"IF(Worksheet!J198<Worksheet!H198,Worksheet!J198,Worksheet!H198)","v":{"$error":"#N/A"}}]
[null,null,null,null,3,"Subtract 2 from 1",null,null,null,null,{"$f":"K4-K5","v":{"$error":"#N/A"}}]
[null,null,null,null,4,"Line 3 x .5",null,null,null,null,{"$f":"K6*0.5","v":{"$error":"#N/A"}}]
[null,null,null,"Step 2",5,"Enter the total Line D.1",null,null,null,null,{"$f":"Worksheet!L141","v":0},null,null,{"$f":"Worksheet!L141","v":0}]
[null,null,null,null,6,"Enter the total Line D.3",null,null,null,null,{"$f":"Worksheet!L156","v":{"$error":"#N/A"}}]
[null,null,null,null,7,"If written agreement provide clothing (Y or N)",null,null,null,null,{"$f":"Worksheet!I90","v":"Y"}]
{"$rows_left_out":25}
{"sheet":"Sheet11","index":10,"n_rows":73,"n_cols":9,"rows_kept":73,"cut":false,"hidden":true,"merged":[]}
[]
[null,null,null,null,"Custodial Parent",null,null,null,"Noncustodial Parent"]
[null,null,null,null,"Filing Status",null,null,null,"Filing Status"]
[null,null,null,null,"Federal Tax Rate",null,null,null,"Federal Tax Rate"]
[null,null,null,null,"State Tax Rate",null,null,null,"State Tax Rate"]
[null,null,null,null,"% of Income",null,null,null,"% of Income"]
[null,null,null,null,"Adjusted Gross ",null,null,null,"Adjusted Gross"]
[]
[]
[]
{"$rows_left_out":64}
{"sheet":"Tax Rates","index":11,"n_rows":72,"n_cols":22,"rows_kept":72,"cut":false,"hidden":true,"merged":[[3,13,3,14]]}
[null,null,null,null,null,null,null,null,null,null,null,{"$f":"M1*12","v":0},{"$f":"IF(Worksheet!F45=\"M\",Worksheet!J141,Worksheet!H141)","v":0},null,null,{"$f":"Q1*12","v":0},{"$f":"IF(Worksheet!F45=\"M\",Worksheet!H141,Worksheet!J141)","v":0}]
[null,null,null,null,null,null,{"$f":"IF(Worksheet!F33=\"Head of Household\",-D38,0)","v":0},{"$f":"IF(Worksheet!F33=\"Single\",-D37,0)","v":0},{"$f":"IF(Worksheet!F33=\"Married-Joint\",-G37,0)","v":0},{"$f":"IF(Worksheet!F33=\"Married-Sep.\",-G37,0)","v":0},null,{"$f":"G2+H2+I2+J2","v":0},null,null,null,{"$f":"T2+S2+R2+Q2","v":0},{"$f":"IF(Worksheet!F40=\"Married-Sep.\",-G37,0)","v":0},{"$f":"IF(Worksheet!F40=\"Married-Joint\",-G37,0)","v":0},{"$f":"IF(Worksheet!F40=\"Single\",-D37,0)","v":0},{"$f":"IF(Worksheet!F40=\"Head of Household\",-D38,0)","v":0}]
[]
[null,"Custodial Parent",null,null,null,"Noncustodial Parent",null,null,null,null,"Custodial",{"$f":"L1+L2","v":0},null,"Noncustodial",null,{"$f":"P1+P2","v":0}]
[null,"Filing Status",null,null,null,"Filing Status",{"$f":"IF(Worksheet!F33=\"Head of Household\",-D43,0)","v":0},{"$f":"IF(Worksheet!F33=\"Single\",-D42,0)","v":0},{"$f":"IF(Worksheet!F33=\"Married-Joint\",-D43,0)","v":0},{"$f":"IF(Worksheet!F33=\"Married-Sep.\",-D43,0)","v":0},null,{"$f":"G5+H5+I5+J5","v":0},null,null,null,{"$f":"T5+S5+R5+Q5","v":0},{"$f":"IF(Worksheet!F40=\"Married-Sep.\",-D43,0)","v":0},{"$f":"IF(Worksheet!F40=\"Married-Joint\",-D43,0)","v":0},{"$f":"IF(Worksheet!F40=\"Single\",-D42,0)","v":0},{"$f":"IF(Worksheet!F40=\"Head of Household\",-D43,0)","v":0}]
[null,"Federal Tax Rate",null,null,null,"Federal Tax Rate",null,null,"Federal Tax Rate",null,null,"Federal Married filing Jointly",null,null,null,"Federal Head of Household",null,null,null,"Federal Married filing Separately"]
[null,"State Tax Rate",null,null,null,"State Tax Rate",null,null,"Single"]
[null,"% of Income",null,null,null,"% of Income",null,null,0,null,null,0,null,null,null,0,null,null,null,0]
[null,"Adjusted Gross ",null,null,null,"Adjusted Gross",null,null,8925,0.1,null,17850,0.1,null,null,12750,0.1,null,null,8925,0.1]
[null,null,null,null,null,null,null,null,36250,15,null,72500,15,1740,null,48600,15,1240,null,36250,15,892.5]
{"$rows_left_out":62}